textlive_base amd64+dpb web2c == "No rule to make target 'all'

classic Classic list List threaded Threaded
4 messages Options
Reply | Threaded
Open this post in threaded view
|

textlive_base amd64+dpb web2c == "No rule to make target 'all'

kwesterback
Trying to compile coccinelle on my amd64 dpb builder with -current
sources as of last night fails in the dependency textlive_base. The
last messages are

gmake[1]: Entering directory
'/wrkobjdir/texlive_base-2015/texlive-20150521-source/Work/texk'
Making all in .
gmake[2]: Entering directory
'/wrkobjdir/texlive_base-2015/texlive-20150521-source/Work/texk'
gmake[2]: Leaving directory
'/wrkobjdir/texlive_base-2015/texlive-20150521-source/Work/texk'
Making all in web2c
gmake[2]: Entering directory
'/wrkobjdir/texlive_base-2015/texlive-20150521-source/Work/texk/web2c'
gmake  all-recursive
gmake[3]: Entering directory
'/wrkobjdir/texlive_base-2015/texlive-20150521-source/Work/texk/web2c'
Making all in doc
gmake[4]: Entering directory
'/wrkobjdir/texlive_base-2015/texlive-20150521-source/Work/texk/web2c/doc'
gmake[4]: Nothing to be done for 'all'.
gmake[4]: Leaving directory
'/wrkobjdir/texlive_base-2015/texlive-20150521-source/Work/texk/web2c/doc'
Making all in lib
gmake[4]: Entering directory
'/wrkobjdir/texlive_base-2015/texlive-20150521-source/Work/texk/web2c/lib'
gmake[4]: Nothing to be done for 'all'.
gmake[4]: Leaving directory
'/wrkobjdir/texlive_base-2015/texlive-20150521-source/Work/texk/web2c/lib'
Making all in man
gmake[4]: Entering directory
'/wrkobjdir/texlive_base-2015/texlive-20150521-source/Work/texk/web2c/man'
gmake[4]: Nothing to be done for 'all'.
gmake[4]: Leaving directory
'/wrkobjdir/texlive_base-2015/texlive-20150521-source/Work/texk/web2c/man'
Making all in web2c
gmake[4]: Entering directory
'/wrkobjdir/texlive_base-2015/texlive-20150521-source/Work/texk/web2c/web2c'
gmake[4]: *** No rule to make target 'all'.  Stop.
gmake[4]: Leaving directory
'/wrkobjdir/texlive_base-2015/texlive-20150521-source/Work/texk/web2c/web2c'
gmake[3]: *** [Makefile:13894: all-recursive] Error 1
gmake[3]: Leaving directory
'/wrkobjdir/texlive_base-2015/texlive-20150521-source/Work/texk/web2c'
gmake[2]: *** [Makefile:3660: all] Error 2
gmake[2]: Leaving directory
'/wrkobjdir/texlive_base-2015/texlive-20150521-source/Work/texk/web2c'
gmake[1]: *** [Makefile:479: all-recursive] Error 1
gmake[1]: Leaving directory
'/wrkobjdir/texlive_base-2015/texlive-20150521-source/Work/texk'
gmake: *** [Makefile:567: all-recursive] Error 1
*** Error 2 in print/texlive/base
(/usr/ports/infrastructure/mk/bsd.port.mk:2679
'/wrkobjdir/texlive_base-2015/.build_done')
*** Error 1 in print/texlive/base
(/usr/ports/infrastructure/mk/bsd.port.mk:2397 'build')
===> Exiting print/texlive/base with an error
*** Error 1 in /usr/ports (infrastructure/mk/bsd.port.subdir.mk:147
'build')
Error: job failed 256

Full log available on request.

Cluebats?

.... Ken

Reply | Threaded
Open this post in threaded view
|

Re: textlive_base amd64+dpb web2c == "No rule to make target 'all'

Edd Barrett-3
On Sun, Aug 21, 2016 at 08:54:14AM -0400, Kenneth R Westerback wrote:
> Trying to compile coccinelle on my amd64 dpb builder with -current
> sources as of last night fails in the dependency textlive_base. The
> last messages are

That's weird. I'm going to kick off my own dpb build and see if I can
repro.

--
Best Regards
Edd Barrett

http://www.theunixzoo.co.uk

Reply | Threaded
Open this post in threaded view
|

Re: textlive_base amd64+dpb web2c == "No rule to make target 'all'

Christian Weisgerber
In reply to this post by kwesterback
On 2016-08-21, Kenneth R Westerback <[hidden email]> wrote:

> Trying to compile coccinelle on my amd64 dpb builder with -current
> sources as of last night fails in the dependency textlive_base. The
> last messages are

FWIW, I have not seen this in the amd64 package builds.

--
Christian "naddy" Weisgerber                          [hidden email]

Reply | Threaded
Open this post in threaded view
|

Re: textlive_base amd64+dpb web2c == "No rule to make target 'all'

kwesterback
On Fri, 26 Aug 2016 at 16:00 Christian Weisgerber <[hidden email]>
wrote:

> On 2016-08-21, Kenneth R Westerback <[hidden email]> wrote:
>
> > Trying to compile coccinelle on my amd64 dpb builder with -current
> > sources as of last night fails in the dependency textlive_base. The
> > last messages are
>
> FWIW, I have not seen this in the amd64 package builds.
>
> --
> Christian "naddy" Weisgerber                          [hidden email]
>
>
And it has not recurred here either. So I'm writing it off as a result of
some mixup on my part.

.... Ken