aarch64 bulk build report

classic Classic list List threaded Threaded
3 messages Options
Reply | Threaded
Open this post in threaded view
|

aarch64 bulk build report

phessler
bulk build on arm64.ports.openbsd.org
started on  Fri Sep 27 00:16:30 MDT 2019
finished at Fri Sep 27 21:47:36 MDT 2019
lasted 0D21h31m
done with kern.version=OpenBSD 6.6-beta (GENERIC.MP) #243: Thu Sep 26 22:11:11 MDT 2019

built packages:8273
Sep 27:8272


critical path missing pkgs:  http://build-failures.rhaalovely.net/aarch64/2019-09-27/summary.log

build failures: 44
http://build-failures.rhaalovely.net/aarch64/2019-09-27/comms/lcdproc.log
http://build-failures.rhaalovely.net/aarch64/2019-09-27/devel/go-check-v1.log
http://build-failures.rhaalovely.net/aarch64/2019-09-27/devel/go-sys.log
http://build-failures.rhaalovely.net/aarch64/2019-09-27/devel/ocaml-configurator.log
http://build-failures.rhaalovely.net/aarch64/2019-09-27/devel/py-filebytes.log
http://build-failures.rhaalovely.net/aarch64/2019-09-27/devel/pycharm.log
http://build-failures.rhaalovely.net/aarch64/2019-09-27/editors/xwpe.log
http://build-failures.rhaalovely.net/aarch64/2019-09-27/games/dxx-rebirth.log
http://build-failures.rhaalovely.net/aarch64/2019-09-27/games/freedink/game.log
http://build-failures.rhaalovely.net/aarch64/2019-09-27/games/frozen-bubble,-main.log
http://build-failures.rhaalovely.net/aarch64/2019-09-27/games/julius.log
http://build-failures.rhaalovely.net/aarch64/2019-09-27/games/vacuum.log
http://build-failures.rhaalovely.net/aarch64/2019-09-27/graphics/colord.log
http://build-failures.rhaalovely.net/aarch64/2019-09-27/lang/flang/libpgmath.log
http://build-failures.rhaalovely.net/aarch64/2019-09-27/lang/go-bootstrap.log
http://build-failures.rhaalovely.net/aarch64/2019-09-27/lang/pfe.log
http://build-failures.rhaalovely.net/aarch64/2019-09-27/net/icinga/web.log
http://build-failures.rhaalovely.net/aarch64/2019-09-27/net/mattermost-server.log
http://build-failures.rhaalovely.net/aarch64/2019-09-27/net/minio/client.log
http://build-failures.rhaalovely.net/aarch64/2019-09-27/net/syncthing.log
http://build-failures.rhaalovely.net/aarch64/2019-09-27/security/aircrack-ng.log
http://build-failures.rhaalovely.net/aarch64/2019-09-27/security/go-siphash.log
http://build-failures.rhaalovely.net/aarch64/2019-09-27/security/gopass.log
http://build-failures.rhaalovely.net/aarch64/2019-09-27/security/sn0int.log
http://build-failures.rhaalovely.net/aarch64/2019-09-27/shells/elvish.log
http://build-failures.rhaalovely.net/aarch64/2019-09-27/sysutils/amazon-ecs-cli.log
http://build-failures.rhaalovely.net/aarch64/2019-09-27/sysutils/awless.log
http://build-failures.rhaalovely.net/aarch64/2019-09-27/sysutils/beats/filebeat.log
http://build-failures.rhaalovely.net/aarch64/2019-09-27/sysutils/beats/heartbeat.log
http://build-failures.rhaalovely.net/aarch64/2019-09-27/sysutils/beats/metricbeat.log
http://build-failures.rhaalovely.net/aarch64/2019-09-27/sysutils/beats/packetbeat.log
http://build-failures.rhaalovely.net/aarch64/2019-09-27/sysutils/fzf.log
http://build-failures.rhaalovely.net/aarch64/2019-09-27/sysutils/node_exporter.log
http://build-failures.rhaalovely.net/aarch64/2019-09-27/sysutils/nomad.log
http://build-failures.rhaalovely.net/aarch64/2019-09-27/sysutils/prometheus.log
http://build-failures.rhaalovely.net/aarch64/2019-09-27/sysutils/rclone.log
http://build-failures.rhaalovely.net/aarch64/2019-09-27/sysutils/restic.log
http://build-failures.rhaalovely.net/aarch64/2019-09-27/sysutils/serf.log
http://build-failures.rhaalovely.net/aarch64/2019-09-27/sysutils/telegraf.log
http://build-failures.rhaalovely.net/aarch64/2019-09-27/sysutils/terraform/provider-vsphere.log
http://build-failures.rhaalovely.net/aarch64/2019-09-27/textproc/go-text.log
http://build-failures.rhaalovely.net/aarch64/2019-09-27/textproc/go-xlsx.log
http://build-failures.rhaalovely.net/aarch64/2019-09-27/www/hugo.log
http://build-failures.rhaalovely.net/aarch64/2019-09-27/www/kibana.log

recurrent failures
 failures/comms/lcdproc.log
 failures/devel/go-check-v1.log
 failures/devel/go-sys.log
 failures/editors/xwpe.log
 failures/games/dxx-rebirth.log
 failures/games/freedink/game.log
 failures/games/frozen-bubble,-main.log
 failures/games/julius.log
 failures/games/vacuum.log
 failures/lang/flang/libpgmath.log
 failures/lang/go-bootstrap.log
 failures/lang/pfe.log
 failures/net/mattermost-server.log
 failures/net/minio/client.log
 failures/net/syncthing.log
 failures/sysutils/restic.log
 failures/sysutils/serf.log
 failures/sysutils/telegraf.log
 failures/sysutils/terraform/provider-vsphere.log
 failures/textproc/go-text.log
 failures/textproc/go-xlsx.log
 failures/www/hugo.log
new failures
+++ ls-failures Fri Sep 27 21:47:47 2019
+failures/devel/ocaml-configurator.log
+failures/devel/py-filebytes.log
+failures/devel/pycharm.log
+failures/graphics/colord.log
+failures/net/icinga/web.log
+failures/www/kibana.log
resolved failures
--- ../old/aarch64/last//ls-failures Wed Sep 25 04:44:27 2019
-failures/comms/gnuradio.log
-failures/databases/evolution-data-server.log
-failures/editors/tpad.log
-failures/geo/qlandkartegt.log
-failures/graphics/openimageio.log
-failures/lang/ocaml.log
-failures/sysutils/terraform/provider-datadog.log
-failures/www/chromium.log
-failures/x11/e17/elementary.log
-failures/x11/gnome/clocks.log
-failures/x11/gnome/gjs.log
-failures/x11/gnome/initial-setup.log
-failures/x11/gnome/settings-daemon.log
-failures/x11/qt5/qt3d.log

Reply | Threaded
Open this post in threaded view
|

Re: aarch64 bulk build report

Kurt Miller-4
On Fri, 2019-09-27 at 21:47 -0600, [hidden email] wrote:

> bulk build on arm64.ports.openbsd.org
> started on  Fri Sep 27 00:16:30 MDT 2019
> finished at Fri Sep 27 21:47:36 MDT 2019
> lasted 0D21h31m
> done with kern.version=OpenBSD 6.6-beta (GENERIC.MP) #243: Thu Sep 26 22:11:11 MDT 2019
>
> built packages:8273
> Sep 27:8272
>
>
> critical path missing pkgs:  http://build-failures.rhaalovely.net/aarch64/2019-09-27/summary.log
>


It looks like colord failure took out a lot of ports. I am unable
to reproduce the segfault in the build log:

../../client/cd-create-profile \
        --output Gamma6500K.icc \
        ./Gamma6500K.xml
../../client/cd-create-profile \
        --output Crayons.icc \
        ./Crayons.xml
../../client/cd-create-profile \
        --output x11-colors.icc \
        ./x11-colors.xml
gmake[3]: *** [Makefile:796: x11-colors.icc] Segmentation fault (core dumped)
gmake[3]: Leaving directory '/usr/obj/ports/colord-1.3.5/colord-1.3.5/data/profiles'
gmake[2]: *** [Makefile:642: all-recursive] Error 1
gmake[2]: Leaving directory '/usr/obj/ports/colord-1.3.5/colord-1.3.5/data'
gmake[1]: *** [Makefile:579: all-recursive] Error 1
gmake[1]: Leaving directory '/usr/obj/ports/colord-1.3.5/colord-1.3.5'
gmake: *** [Makefile:511: all] Error 2

I don't see what might have fixed this in its depends either.


> build failures: 44
> http://build-failures.rhaalovely.net/aarch64/2019-09-27/comms/lcdproc.log
> http://build-failures.rhaalovely.net/aarch64/2019-09-27/devel/go-check-v1.log
> http://build-failures.rhaalovely.net/aarch64/2019-09-27/devel/go-sys.log
> http://build-failures.rhaalovely.net/aarch64/2019-09-27/devel/ocaml-configurator.log
> http://build-failures.rhaalovely.net/aarch64/2019-09-27/devel/py-filebytes.log
> http://build-failures.rhaalovely.net/aarch64/2019-09-27/devel/pycharm.log
> http://build-failures.rhaalovely.net/aarch64/2019-09-27/editors/xwpe.log
> http://build-failures.rhaalovely.net/aarch64/2019-09-27/games/dxx-rebirth.log
> http://build-failures.rhaalovely.net/aarch64/2019-09-27/games/freedink/game.log
> http://build-failures.rhaalovely.net/aarch64/2019-09-27/games/frozen-bubble,-main.log
> http://build-failures.rhaalovely.net/aarch64/2019-09-27/games/julius.log
> http://build-failures.rhaalovely.net/aarch64/2019-09-27/games/vacuum.log
> http://build-failures.rhaalovely.net/aarch64/2019-09-27/graphics/colord.log
> http://build-failures.rhaalovely.net/aarch64/2019-09-27/lang/flang/libpgmath.log
> http://build-failures.rhaalovely.net/aarch64/2019-09-27/lang/go-bootstrap.log
> http://build-failures.rhaalovely.net/aarch64/2019-09-27/lang/pfe.log
> http://build-failures.rhaalovely.net/aarch64/2019-09-27/net/icinga/web.log
> http://build-failures.rhaalovely.net/aarch64/2019-09-27/net/mattermost-server.log
> http://build-failures.rhaalovely.net/aarch64/2019-09-27/net/minio/client.log
> http://build-failures.rhaalovely.net/aarch64/2019-09-27/net/syncthing.log
> http://build-failures.rhaalovely.net/aarch64/2019-09-27/security/aircrack-ng.log
> http://build-failures.rhaalovely.net/aarch64/2019-09-27/security/go-siphash.log
> http://build-failures.rhaalovely.net/aarch64/2019-09-27/security/gopass.log
> http://build-failures.rhaalovely.net/aarch64/2019-09-27/security/sn0int.log
> http://build-failures.rhaalovely.net/aarch64/2019-09-27/shells/elvish.log
> http://build-failures.rhaalovely.net/aarch64/2019-09-27/sysutils/amazon-ecs-cli.log
> http://build-failures.rhaalovely.net/aarch64/2019-09-27/sysutils/awless.log
> http://build-failures.rhaalovely.net/aarch64/2019-09-27/sysutils/beats/filebeat.log
> http://build-failures.rhaalovely.net/aarch64/2019-09-27/sysutils/beats/heartbeat.log
> http://build-failures.rhaalovely.net/aarch64/2019-09-27/sysutils/beats/metricbeat.log
> http://build-failures.rhaalovely.net/aarch64/2019-09-27/sysutils/beats/packetbeat.log
> http://build-failures.rhaalovely.net/aarch64/2019-09-27/sysutils/fzf.log
> http://build-failures.rhaalovely.net/aarch64/2019-09-27/sysutils/node_exporter.log
> http://build-failures.rhaalovely.net/aarch64/2019-09-27/sysutils/nomad.log
> http://build-failures.rhaalovely.net/aarch64/2019-09-27/sysutils/prometheus.log
> http://build-failures.rhaalovely.net/aarch64/2019-09-27/sysutils/rclone.log
> http://build-failures.rhaalovely.net/aarch64/2019-09-27/sysutils/restic.log
> http://build-failures.rhaalovely.net/aarch64/2019-09-27/sysutils/serf.log
> http://build-failures.rhaalovely.net/aarch64/2019-09-27/sysutils/telegraf.log
> http://build-failures.rhaalovely.net/aarch64/2019-09-27/sysutils/terraform/provider-vsphere.log
> http://build-failures.rhaalovely.net/aarch64/2019-09-27/textproc/go-text.log
> http://build-failures.rhaalovely.net/aarch64/2019-09-27/textproc/go-xlsx.log
> http://build-failures.rhaalovely.net/aarch64/2019-09-27/www/hugo.log
> http://build-failures.rhaalovely.net/aarch64/2019-09-27/www/kibana.log
>
> recurrent failures
>  failures/comms/lcdproc.log
>  failures/devel/go-check-v1.log
>  failures/devel/go-sys.log
>  failures/editors/xwpe.log
>  failures/games/dxx-rebirth.log
>  failures/games/freedink/game.log
>  failures/games/frozen-bubble,-main.log
>  failures/games/julius.log
>  failures/games/vacuum.log
>  failures/lang/flang/libpgmath.log
>  failures/lang/go-bootstrap.log
>  failures/lang/pfe.log
>  failures/net/mattermost-server.log
>  failures/net/minio/client.log
>  failures/net/syncthing.log
>  failures/sysutils/restic.log
>  failures/sysutils/serf.log
>  failures/sysutils/telegraf.log
>  failures/sysutils/terraform/provider-vsphere.log
>  failures/textproc/go-text.log
>  failures/textproc/go-xlsx.log
>  failures/www/hugo.log
> new failures
> +++ ls-failures Fri Sep 27 21:47:47 2019
> +failures/devel/ocaml-configurator.log
> +failures/devel/py-filebytes.log
> +failures/devel/pycharm.log
> +failures/graphics/colord.log
> +failures/net/icinga/web.log
> +failures/www/kibana.log
> resolved failures
> --- ../old/aarch64/last//ls-failures Wed Sep 25 04:44:27 2019
> -failures/comms/gnuradio.log
> -failures/databases/evolution-data-server.log
> -failures/editors/tpad.log
> -failures/geo/qlandkartegt.log
> -failures/graphics/openimageio.log
> -failures/lang/ocaml.log
> -failures/sysutils/terraform/provider-datadog.log
> -failures/www/chromium.log
> -failures/x11/e17/elementary.log
> -failures/x11/gnome/clocks.log
> -failures/x11/gnome/gjs.log
> -failures/x11/gnome/initial-setup.log
> -failures/x11/gnome/settings-daemon.log
> -failures/x11/qt5/qt3d.log
>

Reply | Threaded
Open this post in threaded view
|

Re: aarch64 bulk build report

Christian Weisgerber
Kurt Miller:

> It looks like colord failure took out a lot of ports. I am unable
> to reproduce the segfault in the build log:

This is a sporadic segfault.  It is machine independent and happens
on amd64, too.  It is fairly easy to reproduce on amd64, just run
colord in a build loop.  Nobody has managed to debug it yet.

--
Christian "naddy" Weisgerber                          [hidden email]