aarch64 bulk build report

classic Classic list List threaded Threaded
2 messages Options
Reply | Threaded
Open this post in threaded view
|

aarch64 bulk build report

phessler
bulk build on arm64.ports.openbsd.org
started on  Sat Jan 5 14:06:09 MST 2019
finished at Tue Jan 8 12:10:02 MST 2019
lasted 03D15h03m
done with kern.version=OpenBSD 6.4-current (GENERIC.MP) #354: Sat Jan  5 12:19:10 MST 2019

built packages:9153
Jan 5:2865
Jan 6:1684
Jan 7:1895
Jan 8:2708



critical path missing pkgs:  http://build-failures.rhaalovely.net/aarch64/2019-01-05/summary.log

build failures: 54
http://build-failures.rhaalovely.net/aarch64/2019-01-05/astro/wcslib.log
http://build-failures.rhaalovely.net/aarch64/2019-01-05/audio/chromaprint.log
http://build-failures.rhaalovely.net/aarch64/2019-01-05/audio/grip.log
http://build-failures.rhaalovely.net/aarch64/2019-01-05/comms/gnuradio.log
http://build-failures.rhaalovely.net/aarch64/2019-01-05/comms/lcdproc.log
http://build-failures.rhaalovely.net/aarch64/2019-01-05/databases/sqlports.log
http://build-failures.rhaalovely.net/aarch64/2019-01-05/devel/avr/gdb.log
http://build-failures.rhaalovely.net/aarch64/2019-01-05/devel/libcoap.log
http://build-failures.rhaalovely.net/aarch64/2019-01-05/devel/ode.log
http://build-failures.rhaalovely.net/aarch64/2019-01-05/devel/pony-stable.log
http://build-failures.rhaalovely.net/aarch64/2019-01-05/editors/xwpe.log
http://build-failures.rhaalovely.net/aarch64/2019-01-05/emulators/dynamips.log
http://build-failures.rhaalovely.net/aarch64/2019-01-05/emulators/vbam.log
http://build-failures.rhaalovely.net/aarch64/2019-01-05/emulators/vice.log
http://build-failures.rhaalovely.net/aarch64/2019-01-05/games/dungeon-crawl.log
http://build-failures.rhaalovely.net/aarch64/2019-01-05/games/frozen-bubble.log
http://build-failures.rhaalovely.net/aarch64/2019-01-05/games/openclonk.log
http://build-failures.rhaalovely.net/aarch64/2019-01-05/games/spacehulk.log
http://build-failures.rhaalovely.net/aarch64/2019-01-05/games/stepmania.log
http://build-failures.rhaalovely.net/aarch64/2019-01-05/games/vacuum.log
http://build-failures.rhaalovely.net/aarch64/2019-01-05/geo/qlandkartegt.log
http://build-failures.rhaalovely.net/aarch64/2019-01-05/graphics/colord.log
http://build-failures.rhaalovely.net/aarch64/2019-01-05/graphics/freeimage.log
http://build-failures.rhaalovely.net/aarch64/2019-01-05/graphics/openimageio.log
http://build-failures.rhaalovely.net/aarch64/2019-01-05/graphics/openscenegraph.log
http://build-failures.rhaalovely.net/aarch64/2019-01-05/graphics/ufraw.log
http://build-failures.rhaalovely.net/aarch64/2019-01-05/japanese/mecab,-ipadic.log
http://build-failures.rhaalovely.net/aarch64/2019-01-05/lang/classpath.log
http://build-failures.rhaalovely.net/aarch64/2019-01-05/lang/gcc/4.9,,-libs.log
http://build-failures.rhaalovely.net/aarch64/2019-01-05/lang/pfe.log
http://build-failures.rhaalovely.net/aarch64/2019-01-05/mail/kopano/core.log
http://build-failures.rhaalovely.net/aarch64/2019-01-05/math/R.log
http://build-failures.rhaalovely.net/aarch64/2019-01-05/math/arpack.log
http://build-failures.rhaalovely.net/aarch64/2019-01-05/math/cblas.log
http://build-failures.rhaalovely.net/aarch64/2019-01-05/math/z3.log
http://build-failures.rhaalovely.net/aarch64/2019-01-05/misc/openbabel.log
http://build-failures.rhaalovely.net/aarch64/2019-01-05/misc/rocrail,-gui.log
http://build-failures.rhaalovely.net/aarch64/2019-01-05/multimedia/gstreamer-0.10/py-gstreamer.log
http://build-failures.rhaalovely.net/aarch64/2019-01-05/net/castget.log
http://build-failures.rhaalovely.net/aarch64/2019-01-05/print/lyx.log
http://build-failures.rhaalovely.net/aarch64/2019-01-05/productivity/aqbanking.log
http://build-failures.rhaalovely.net/aarch64/2019-01-05/security/gpgme.log
http://build-failures.rhaalovely.net/aarch64/2019-01-05/security/libnipper.log
http://build-failures.rhaalovely.net/aarch64/2019-01-05/security/softhsm.log
http://build-failures.rhaalovely.net/aarch64/2019-01-05/sysutils/sleuthkit.log
http://build-failures.rhaalovely.net/aarch64/2019-01-05/textproc/link-grammar,-main.log
http://build-failures.rhaalovely.net/aarch64/2019-01-05/www/kwebapp.log
http://build-failures.rhaalovely.net/aarch64/2019-01-05/www/mozilla-firefox.log
http://build-failures.rhaalovely.net/aarch64/2019-01-05/www/webkitgtk4.log
http://build-failures.rhaalovely.net/aarch64/2019-01-05/x11/gnome/gjs.log
http://build-failures.rhaalovely.net/aarch64/2019-01-05/x11/qt5/qt3d.log
http://build-failures.rhaalovely.net/aarch64/2019-01-05/x11/qt5/qtgraphicaleffects.log
http://build-failures.rhaalovely.net/aarch64/2019-01-05/x11/qt5/qtquickcontrols.log
http://build-failures.rhaalovely.net/aarch64/2019-01-05/x11/qt5/qtquickcontrols2.log

recurrent failures
 failures/comms/lcdproc.log
 failures/databases/sqlports.log
 failures/devel/ode.log
 failures/devel/pony-stable.log
 failures/editors/xwpe.log
 failures/emulators/dynamips.log
 failures/emulators/vbam.log
 failures/emulators/vice.log
 failures/games/dungeon-crawl.log
 failures/games/spacehulk.log
 failures/games/vacuum.log
 failures/graphics/freeimage.log
 failures/japanese/mecab,-ipadic.log
 failures/lang/pfe.log
 failures/mail/kopano/core.log
 failures/math/z3.log
 failures/misc/rocrail,-gui.log
 failures/net/castget.log
 failures/productivity/aqbanking.log
 failures/security/libnipper.log
 failures/security/softhsm.log
 failures/sysutils/sleuthkit.log
 failures/textproc/link-grammar,-main.log
 failures/www/kwebapp.log
 failures/www/mozilla-firefox.log
new failures
+++ ls-failures Tue Jan  8 12:17:15 2019
+failures/astro/wcslib.log
+failures/audio/chromaprint.log
+failures/audio/grip.log
+failures/comms/gnuradio.log
+failures/devel/avr/gdb.log
+failures/devel/libcoap.log
+failures/games/frozen-bubble.log
+failures/games/openclonk.log
+failures/games/stepmania.log
+failures/geo/qlandkartegt.log
+failures/graphics/colord.log
+failures/graphics/openimageio.log
+failures/graphics/openscenegraph.log
+failures/graphics/ufraw.log
+failures/lang/classpath.log
+failures/lang/gcc/4.9,,-libs.log
+failures/math/R.log
+failures/math/arpack.log
+failures/math/cblas.log
+failures/misc/openbabel.log
+failures/multimedia/gstreamer-0.10/py-gstreamer.log
+failures/print/lyx.log
+failures/security/gpgme.log
+failures/www/webkitgtk4.log
+failures/x11/gnome/gjs.log
+failures/x11/qt5/qt3d.log
+failures/x11/qt5/qtgraphicaleffects.log
+failures/x11/qt5/qtquickcontrols.log
+failures/x11/qt5/qtquickcontrols2.log
resolved failures
--- ../old/aarch64/last//ls-failures Sat Dec 29 05:58:07 2018
-failures/devel/bullet.log
-failures/devel/tbb.log
-failures/fonts/mftrace.log
-failures/games/frozen-bubble,-main.log
-failures/inputmethods/uim.log
-failures/math/p5-Math-Int128.log
-failures/print/bg5ps.log
-failures/x11/p5-Wx.log

Reply | Threaded
Open this post in threaded view
|

Re: aarch64 bulk build report

Anthony J. Bentley-4
[hidden email] writes:
> http://build-failures.rhaalovely.net/aarch64/2019-01-05/comms/gnuradio.log

-- Performing Test SSE2_SUPPORTED
-- Performing Test SSE2_SUPPORTED - Success
(snip)
/usr/obj/ports/gnuradio-3.7.13.4/gnuradio-3.7.13.4/gr-dtv/lib/dvbt/dvbt_viterbi_decoder_impl.h:28:10: fatal error: 'xmmintrin.h' file not found

> http://build-failures.rhaalovely.net/aarch64/2019-01-05/games/openclonk.log

-- Performing Test HAVE_CFLAG_MSSE2
-- Performing Test HAVE_CFLAG_MSSE2 - Success
(snip)
/usr/obj/ports/openclonk-8.1/openclonk-release-8.1-src/thirdparty/blake2/blake2b.c:28:10: fatal error: 'emmintrin.h' file not found

> http://build-failures.rhaalovely.net/aarch64/2019-01-05/math/z3.log

FP math:        SSE2-CLANG
(snip)
../src/util/mpz.cpp:33:10: fatal error: 'immintrin.h' file not found


Why does -msse2 not fail on arm64? It seems several ports enable
intrinsics if this flag succeeds during configure.

--
Anthony J. Bentley