OpenBSD stable

classic Classic list List threaded Threaded
1 message Options
Reply | Threaded
Open this post in threaded view
|

OpenBSD stable

George
Hi!
I recently tried to update to stable with dpb.
dpb fail with the following message.

Elapsed time=00:00:31
I=371 B=1 Q=0 T=28 F=0 !=2
L=mail/mozilla-thunderbird
E=www/iridium mail/mozilla-thunderbird devel/jdk/1.7

i tried to update manual jdk. I used export FLAVOR="native_bootstrap" to
pass the initial error message i was getting.
After a while i got another error message.

Is there another way to bootstrap jdk?

thanks



ps.The second error im getting

f [ -d
/usr/ports/pobj/jdk-1.7.0.80-native_bootstrap/openjdk/hotspot/agent -a
"x86" != "ia64" \
             -a "x86" != "arm" \
             -a "x86" != "ppc" \
             -a "x86" != "zero" ] ; then \
   gmake -f sa.make
/usr/ports/pobj/jdk-1.7.0.80-native_bootstrap/openjdk/build/bsd-amd64/hotspot/outputdir/bsd_amd64_compiler2/product/../generated/sa-jdi.jar;
\
fi
gmake[7]: Entering directory
'/usr/ports/pobj/jdk-1.7.0.80-native_bootstrap/openjdk/build/bsd-amd64/hotspot/outputdir/bsd_amd64_compiler2/product'
gmake[7]:
'/usr/ports/pobj/jdk-1.7.0.80-native_bootstrap/openjdk/build/bsd-amd64/hotspot/outputdir/bsd_amd64_compiler2/product/../generated/sa-jdi.jar'
is up to date.
gmake[7]: Leaving directory
'/usr/ports/pobj/jdk-1.7.0.80-native_bootstrap/openjdk/build/bsd-amd64/hotspot/outputdir/bsd_amd64_compiler2/product'
gmake[6]: Leaving directory
'/usr/ports/pobj/jdk-1.7.0.80-native_bootstrap/openjdk/build/bsd-amd64/hotspot/outputdir/bsd_amd64_compiler2/product'
gmake[6]: Entering directory
'/usr/ports/pobj/jdk-1.7.0.80-native_bootstrap/openjdk/build/bsd-amd64/hotspot/outputdir/bsd_amd64_compiler2/product'
gmake[6]: 'precompiled.hpp.gch' is up to date.
gmake[6]: Leaving directory
'/usr/ports/pobj/jdk-1.7.0.80-native_bootstrap/openjdk/build/bsd-amd64/hotspot/outputdir/bsd_amd64_compiler2/product'
gmake[6]: Entering directory
'/usr/ports/pobj/jdk-1.7.0.80-native_bootstrap/openjdk/build/bsd-amd64/hotspot/outputdir/bsd_amd64_compiler2/product'
gmake[6]: Nothing to be done for 'default'.
gmake[6]: Leaving directory
'/usr/ports/pobj/jdk-1.7.0.80-native_bootstrap/openjdk/build/bsd-amd64/hotspot/outputdir/bsd_amd64_compiler2/product'
All done.
gmake[5]: Leaving directory
'/usr/ports/pobj/jdk-1.7.0.80-native_bootstrap/openjdk/build/bsd-amd64/hotspot/outputdir/bsd_amd64_compiler2/product'
cd bsd_amd64_compiler2/product && ./test_gamma
Using java runtime at: /usr/local/jdk-1.7.0/jre
Abort trap (core dumped)
gmake[4]: ***
[/usr/ports/pobj/jdk-1.7.0.80-native_bootstrap/openjdk/hotspot/make/bsd/Makefile:293:
product] Error 134
gmake[4]: Leaving directory
'/usr/ports/pobj/jdk-1.7.0.80-native_bootstrap/openjdk/build/bsd-amd64/hotspot/outputdir'
gmake[3]: *** [Makefile:192: generic_build2] Error 2
gmake[3]: Leaving directory
'/usr/ports/pobj/jdk-1.7.0.80-native_bootstrap/openjdk/hotspot/make'
gmake[2]: *** [Makefile:151: product] Error 2
gmake[2]: Leaving directory
'/usr/ports/pobj/jdk-1.7.0.80-native_bootstrap/openjdk/hotspot/make'
gmake[1]: *** [make/hotspot-rules.gmk:114: hotspot-build] Error 2
gmake[1]: Leaving directory
'/usr/ports/pobj/jdk-1.7.0.80-native_bootstrap/openjdk'
gmake: *** [Makefile:251: build_product_image] Error 2
*** Error 2 in . (/usr/ports/infrastructure/mk/bsd.port.mk:2674
'/usr/ports/pobj/jdk-1.7.0.80-native_bootstrap/.build_done')
*** Error 1 in . (/usr/ports/infrastructure/mk/bsd.port.mk:1891
'/usr/ports/packages/amd64/all/jdk-1.7.0.80p1v0.tgz')
*** Error 1 in . (/usr/ports/infrastructure/mk/bsd.port.mk:2416
'_internal-package')
*** Error 1 in . (/usr/ports/infrastructure/mk/bsd.port.mk:1917
'/usr/ports/update/amd64/jdk-1.7.0.80p1v0')
*** Error 1 in /usr/ports/devel/jdk/1.7
(/usr/ports/infrastructure/mk/bsd.port.mk:2396 'update')