NEW: graphics/krita

Previous Topic Next Topic
 
classic Classic list List threaded Threaded
8 messages Options
Reply | Threaded
Open this post in threaded view
|

NEW: graphics/krita

Rafael Sadowski
Hi All!

Attached is a port of krita. It is a part of our old editors/calligra
therefore is a @conflict callingra-<=2.9.11 tag in PLIST. Krita "split"
from calligra since 3.0.[1] Tested in amd64.

$ cat pkg/DESCR

Krita is a raster graphics editor based on Qt 5 and the KDE Frameworks 5. Krita
is designed to be a digital painting application. It has been influenced to
some extent by software like Corel Painter and SAI. Krita packs with some key
features different from most of its kind, including the ability to work with
both bitmap and vector illustration.

Core features:

- An adaptive multi-modal interface which works on the desktop and touchscreens
- A large set of default brushes
- Customizable brush presets
- Multiple brush engines, supports pressure sensitivity, tilt and other
  features of graphics tablets
- Wrap around mode canvas for creating and visualizing seamlessly tiled
  textures
- OpenGL powered canvas with high-bit-depth monitor support
- Filters with real-time preview
- A layer engine that allows deeply nested and grouped layers
- Vector, clone, external-file and dynamic filter-effect layers
- Supports a wide range of file formats and color models


Comments? OK to import?

Best regards,

Rafael Sadowski


[1]: https://www.calligra.org/krita/

krita.tar.gz (13K) Download Attachment
Reply | Threaded
Open this post in threaded view
|

Re: NEW: graphics/krita

mitchell wodach
A whole bunch of tests fail.

# make test
===>  Regression tests for krita-3.1.3
[0/1] cd /usr/ports/pobj/krita-3.1.3/build-amd64 &&
/usr/local/bin/ctest --force-new-ctest-process
Test project /usr/ports/pobj/krita-3.1.3/build-amd64
        Start   1: libs-widgetutils-KoPropertiesTest
  1/173 Test   #1: libs-widgetutils-KoPropertiesTest
.........................   Passed    0.08 sec
        Start   2: krita-ui-KisSimpleMathParserTest
  2/173 Test   #2: krita-ui-KisSimpleMathParserTest
..........................   Passed    0.30 sec
        Start   3: libs-widgets-zoomhandler_test
  3/173 Test   #3: libs-widgets-zoomhandler_test
.............................   Passed    0.13 sec
        Start   4: libs-widgets-zoomcontroller_test
  4/173 Test   #4: libs-widgets-zoomcontroller_test
..........................***Exception: Other  0.20 sec
        Start   5: krita-ui-kis_parse_spin_boxes_test
  5/173 Test   #5: krita-ui-kis_parse_spin_boxes_test
........................***Exception: Other  0.40 sec
        Start   6: libs-odf-TestKoLZF
  6/173 Test   #6: libs-odf-TestKoLZF
........................................   Passed    0.13 sec
        Start   7: libs-odf-TestKoXmlVector
  7/173 Test   #7: libs-odf-TestKoXmlVector
..................................   Passed    0.08 sec
        Start   8: libs-odf-TestKoGenStyles
  8/173 Test   #8: libs-odf-TestKoGenStyles
..................................***Exception: Other  0.12 sec
        Start   9: libs-odf-TestOdfSettings
  9/173 Test   #9: libs-odf-TestOdfSettings
..................................   Passed    0.07 sec
        Start  10: libs-odf-TestKoOdfLoadingContext
 10/173 Test  #10: libs-odf-TestKoOdfLoadingContext
..........................   Passed    0.06 sec
        Start  11: libs-odf-TestStorage
 11/173 Test  #11: libs-odf-TestStorage
......................................   Passed    0.12 sec
        Start  12: libs-odf-TestXmlWriter
 12/173 Test  #12: libs-odf-TestXmlWriter
....................................   Passed    0.10 sec
        Start  13: libs-odf-TestXmlReader
 13/173 Test  #13: libs-odf-TestXmlReader
....................................   Passed    0.39 sec
        Start  14: libs-odf-TestXmlReaderWithoutSpaces
 14/173 Test  #14: libs-odf-TestXmlReaderWithoutSpaces
.......................   Passed    0.34 sec
        Start  15: libs-odf-kodomtest
 15/173 Test  #15: libs-odf-kodomtest
........................................***Exception: Other  0.11 sec
        Start  16: libs-odf-TestKoUnit
 16/173 Test  #16: libs-odf-TestKoUnit
.......................................   Passed    0.06 sec
        Start  17: libs-odf-TestNumberStyle
 17/173 Test  #17: libs-odf-TestNumberStyle
..................................***Exception: Other  0.10 sec
        Start  18: libs-odf-TestKoElementReference
 18/173 Test  #18: libs-odf-TestKoElementReference
...........................***Exception: Other  0.11 sec
        Start  19: libs-kritaflake-TestPosition
 19/173 Test  #19: libs-kritaflake-TestPosition
..............................   Passed    0.14 sec
        Start  20: libs-kritaflake-TestSelection
 20/173 Test  #20: libs-kritaflake-TestSelection
.............................   Passed    0.12 sec
        Start  21: libs-kritaflake-TestPathTool
 21/173 Test  #21: libs-kritaflake-TestPathTool
..............................***Exception: Other  0.16 sec
        Start  22: libs-kritaflake-TestShapeAt
 22/173 Test  #22: libs-kritaflake-TestShapeAt
...............................***Exception: Other  0.22 sec
        Start  23: libs-kritaflake-TestShapePainting
 23/173 Test  #23: libs-kritaflake-TestShapePainting
.........................***Exception: Other  0.20 sec
        Start  24: libs-kritaflake-TestKoShapeFactory
 24/173 Test  #24: libs-kritaflake-TestKoShapeFactory
........................   Passed    0.15 sec
        Start  25: libs-kritaflake-TestKoShapeRegistry
 25/173 Test  #25: libs-kritaflake-TestKoShapeRegistry
.......................***Exception: Other  0.16 sec
        Start  26: libs-kritaflake-TestShapeContainer
 26/173 Test  #26: libs-kritaflake-TestShapeContainer
........................***Exception: Other  0.22 sec
        Start  27: libs-kritaflake-TestShapeGroupCommand
 27/173 Test  #27: libs-kritaflake-TestShapeGroupCommand
.....................***Exception: Other  0.19 sec
        Start  28: libs-kritaflake-TestShapeReorderCommand
 28/173 Test  #28: libs-kritaflake-TestShapeReorderCommand
...................***Exception: Other  0.19 sec
        Start  29: libs-kritaflake-TestImageCollection
 29/173 Test  #29: libs-kritaflake-TestImageCollection
.......................***Exception: Other  0.20 sec
        Start  30: libs-kritaflake-TestResourceManager
 30/173 Test  #30: libs-kritaflake-TestResourceManager
.......................***Exception: Other  0.17 sec
        Start  31: libs-kritaflake-TestShapeBackgroundCommand
 31/173 Test  #31: libs-kritaflake-TestShapeBackgroundCommand
................***Exception: Other  0.21 sec
        Start  32: libs-kritaflake-TestShapeStrokeCommand
 32/173 Test  #32: libs-kritaflake-TestShapeStrokeCommand
....................***Exception: Other  0.23 sec
        Start  33: libs-kritaflake-TestShapeShadowCommand
 33/173 Test  #33: libs-kritaflake-TestShapeShadowCommand
....................***Exception: Other  0.17 sec
        Start  34: libs-kritaflake-TestInputDevice
 34/173 Test  #34: libs-kritaflake-TestInputDevice
...........................***Exception: Other  0.20 sec
        Start  35: libs-kritaflake-TestSnapStrategy
 35/173 Test  #35: libs-kritaflake-TestSnapStrategy
..........................***Exception: Other  0.21 sec
        Start  36: libs-pigment-TestKoColorSpaceRegistry
 36/173 Test  #36: libs-pigment-TestKoColorSpaceRegistry
.....................   Passed    1.03 sec
        Start  37: libs-pigment-TestKoColorSpaceAbstract
 37/173 Test  #37: libs-pigment-TestKoColorSpaceAbstract
.....................   Passed    0.05 sec
        Start  38: libs-pigment-TestColorConversionSystem
 38/173 Test  #38: libs-pigment-TestColorConversionSystem
....................   Passed    0.13 sec
        Start  39: libs-pigment-TestKoColor
 39/173 Test  #39: libs-pigment-TestKoColor
..................................***Failed    0.12 sec
        Start  40: libs-pigment-TestKoIntegerMaths
 40/173 Test  #40: libs-pigment-TestKoIntegerMaths
...........................   Passed    0.05 sec
        Start  41: libs-pigment-TestConvolutionOpImpl
 41/173 Test  #41: libs-pigment-TestConvolutionOpImpl
........................   Passed    0.05 sec
        Start  42: libs-pigment-KoRgbU8ColorSpaceTester
 42/173 Test  #42: libs-pigment-KoRgbU8ColorSpaceTester
......................   Passed    0.11 sec
        Start  43: libs-pigment-TestKoColorSpaceSanity
 43/173 Test  #43: libs-pigment-TestKoColorSpaceSanity
.......................***Failed    0.11 sec
        Start  44: libs-pigment-TestFallBackColorTransformation
 44/173 Test  #44: libs-pigment-TestFallBackColorTransformation
..............   Passed    0.12 sec
        Start  45: libs-pigment-TestKoChannelInfo
 45/173 Test  #45: libs-pigment-TestKoChannelInfo
............................   Passed    0.05 sec
        Start  46: libs-pigment-TestColorConversion
 46/173 Test  #46: libs-pigment-TestColorConversion
..........................   Passed    0.05 sec
        Start  47: libs-pigment-TestKoColorSpaceMaths
 47/173 Test  #47: libs-pigment-TestKoColorSpaceMaths
........................   Passed    0.05 sec
        Start  48: krita-libbrush-kis_auto_brush_test
 48/173 Test  #48: krita-libbrush-kis_auto_brush_test
........................***Exception: Other  0.23 sec
        Start  49: krita-libbrush-kis_gbr_brush_test
 49/173 Test  #49: krita-libbrush-kis_gbr_brush_test
.........................***Exception: Other  0.24 sec
        Start  50: krita-libbrush-kis_boundary_test
 50/173 Test  #50: krita-libbrush-kis_boundary_test
..........................***Exception: Other  0.27 sec
        Start  51: krita-libbrush-kis_imagepipe_brush_test
 51/173 Test  #51: krita-libbrush-kis_imagepipe_brush_test
...................***Exception: Other  0.28 sec
        Start  52: krita-image-kis_base_node_test
 52/173 Test  #52: krita-image-kis_base_node_test
............................***Exception: Other  0.23 sec
        Start  53: krita-image-kis_fast_math_test
 53/173 Test  #53: krita-image-kis_fast_math_test
............................***Exception: Other  0.26 sec
        Start  54: krita-image-kis_node_test
 54/173 Test  #54: krita-image-kis_node_test
.................................***Exception: Other  0.26 sec
        Start  55: krita-image-kis_node_facade_test
 55/173 Test  #55: krita-image-kis_node_facade_test
..........................***Exception: Other  0.25 sec
        Start  56: krita-image-kis_fixed_paint_device_test
 56/173 Test  #56: krita-image-kis_fixed_paint_device_test
...................***Exception: Other  0.25 sec
        Start  57: krita-image-kis_layer_test
 57/173 Test  #57: krita-image-kis_layer_test
................................***Exception: Other  0.25 sec
        Start  58: krita-image-kis_effect_mask_test
 58/173 Test  #58: krita-image-kis_effect_mask_test
..........................***Exception: Other  0.25 sec
        Start  59: krita-image-kis_iterator_test
 59/173 Test  #59: krita-image-kis_iterator_test
.............................***Exception: Other  0.23 sec
        Start  60: krita-image-kis_painter_test
 60/173 Test  #60: krita-image-kis_painter_test
..............................***Exception: Other  0.24 sec
        Start  61: krita-image-kis_selection_test
 61/173 Test  #61: krita-image-kis_selection_test
............................***Exception: Other  0.26 sec
        Start  62: krita-image-kis_count_visitor_test
 62/173 Test  #62: krita-image-kis_count_visitor_test
........................***Exception: Other  0.22 sec
        Start  63: krita-image-kis_projection_test
 63/173 Test  #63: krita-image-kis_projection_test
...........................***Exception: Other  0.27 sec
        Start  64: krita-image-kis_properties_configuration_test
 64/173 Test  #64: krita-image-kis_properties_configuration_test
.............***Exception: Other  0.24 sec
        Start  65: krita-image-kis_transaction_test
 65/173 Test  #65: krita-image-kis_transaction_test
..........................***Exception: Other  0.23 sec
        Start  66: krita-image-kis_pixel_selection_test
 66/173 Test  #66: krita-image-kis_pixel_selection_test
......................***Exception: Other  0.24 sec
        Start  67: krita-image-kis_group_layer_test
 67/173 Test  #67: krita-image-kis_group_layer_test
..........................***Exception: Other  0.23 sec
        Start  68: krita-image-kis_paint_layer_test
 68/173 Test  #68: krita-image-kis_paint_layer_test
..........................***Exception: Other  0.24 sec
        Start  69: krita-image-kis_adjustment_layer_test
 69/173 Test  #69: krita-image-kis_adjustment_layer_test
.....................***Exception: Other  0.24 sec
        Start  70: krita-image-kis_annotation_test
 70/173 Test  #70: krita-image-kis_annotation_test
...........................***Exception: Other  0.24 sec
        Start  71: krita-image-kis_change_profile_visitor_test
 71/173 Test  #71: krita-image-kis_change_profile_visitor_test
...............***Exception: Other  0.25 sec
        Start  72: krita-image-kis_clone_layer_test
 72/173 Test  #72: krita-image-kis_clone_layer_test
..........................***Exception: Other  0.25 sec
        Start  73: krita-image-kis_colorspace_convert_visitor_test
 73/173 Test  #73: krita-image-kis_colorspace_convert_visitor_test
...........***Exception: Other  0.24 sec
        Start  74: krita-image-kis_convolution_painter_test
 74/173 Test  #74: krita-image-kis_convolution_painter_test
..................***Exception: Other  0.24 sec
        Start  75: krita-image-kis_crop_processing_visitor_test
 75/173 Test  #75: krita-image-kis_crop_processing_visitor_test
..............***Exception: Other  0.26 sec
        Start  76: krita-image-kis_processing_applicator_test
 76/173 Test  #76: krita-image-kis_processing_applicator_test
................***Exception: Other  0.24 sec
        Start  77: krita-image-kis_datamanager_test
 77/173 Test  #77: krita-image-kis_datamanager_test
..........................***Exception: Other  0.23 sec
        Start  78: krita-image-kis_fill_painter_test
 78/173 Test  #78: krita-image-kis_fill_painter_test
.........................***Exception: Other  0.25 sec
        Start  79: krita-image-kis_filter_configuration_test
 79/173 Test  #79: krita-image-kis_filter_configuration_test
.................***Exception: Other  0.24 sec
        Start  80: krita-image-kis_filter_test
 80/173 Test  #80: krita-image-kis_filter_test
...............................***Exception: Other  0.23 sec
        Start  81: krita-image-kis_filter_processing_information_test
 81/173 Test  #81: krita-image-kis_filter_processing_information_test
........***Exception: Other  0.25 sec
        Start  82: krita-image-kis_filter_registry_test
 82/173 Test  #82: krita-image-kis_filter_registry_test
......................***Exception: Other  0.23 sec
        Start  83: krita-image-kis_filter_strategy_test
 83/173 Test  #83: krita-image-kis_filter_strategy_test
......................***Exception: Other  0.25 sec
        Start  84: krita-image-kis_gradient_painter_test
 84/173 Test  #84: krita-image-kis_gradient_painter_test
.....................***Exception: Other  0.28 sec
        Start  85: krita-image-kis_image_commands_test
 85/173 Test  #85: krita-image-kis_image_commands_test
.......................***Exception: Other  0.23 sec
        Start  86: krita-image-kis_image_test
 86/173 Test  #86: krita-image-kis_image_test
................................***Exception: Other  0.27 sec
        Start  87: krita-image-kis_image_signal_router_test
 87/173 Test  #87: krita-image-kis_image_signal_router_test
..................***Exception: Other  0.25 sec
        Start  88: krita-image-kis_iterators_ng_test
 88/173 Test  #88: krita-image-kis_iterators_ng_test
.........................***Exception: Other  0.25 sec
        Start  89: krita-image-kis_iterator_benchmark
 89/173 Test  #89: krita-image-kis_iterator_benchmark
........................***Exception: Other  0.23 sec
        Start  90: krita-image-kis_updater_context_test
 90/173 Test  #90: krita-image-kis_updater_context_test
......................***Exception: Other  0.23 sec
        Start  91: krita-image-kis_simple_update_queue_test
 91/173 Test  #91: krita-image-kis_simple_update_queue_test
..................***Exception: Other  0.25 sec
        Start  92: krita-image-kis_stroke_test
 92/173 Test  #92: krita-image-kis_stroke_test
...............................***Exception: Other  0.23 sec
        Start  93: krita-image-kis_simple_stroke_strategy_test
 93/173 Test  #93: krita-image-kis_simple_stroke_strategy_test
...............***Exception: Other  0.25 sec
        Start  94: krita-image-kis_stroke_strategy_undo_command_based_test
 94/173 Test  #94:
krita-image-kis_stroke_strategy_undo_command_based_test
...***Exception: Other  0.25 sec
        Start  95: krita-image-kis_strokes_queue_test
 95/173 Test  #95: krita-image-kis_strokes_queue_test
........................***Exception: Other  0.23 sec
        Start  96: krita-image-kis_macro_test
 96/173 Test  #96: krita-image-kis_macro_test
................................***Exception: Other  0.24 sec
        Start  97: krita-image-kis_mask_test
 97/173 Test  #97: krita-image-kis_mask_test
.................................***Exception: Other  0.25 sec
        Start  98: krita-image-kis_math_toolbox_test
 98/173 Test  #98: krita-image-kis_math_toolbox_test
.........................***Exception: Other  0.25 sec
        Start  99: krita-image-kis_name_server_test
 99/173 Test  #99: krita-image-kis_name_server_test
..........................***Exception: Other  0.26 sec
        Start 100: krita-image-kis_node_commands_test
100/173 Test #100: krita-image-kis_node_commands_test
........................***Exception: Other  0.24 sec
        Start 101: krita-image-kis_node_graph_listener_test
101/173 Test #101: krita-image-kis_node_graph_listener_test
..................***Exception: Other  0.23 sec
        Start 102: krita-image-kis_node_visitor_test
102/173 Test #102: krita-image-kis_node_visitor_test
.........................***Exception: Other  0.26 sec
        Start 103: krita-image-kis_paint_information_test
103/173 Test #103: krita-image-kis_paint_information_test
....................***Exception: Other  0.23 sec
        Start 104: krita-image-kis_paintop_test
104/173 Test #104: krita-image-kis_paintop_test
..............................***Exception: Other  0.24 sec
        Start 105: krita-image-kis_pattern_test
105/173 Test #105: krita-image-kis_pattern_test
..............................***Exception: Other  0.27 sec
        Start 106: krita-image-kis_recorded_action_factory_registry_test
106/173 Test #106:
krita-image-kis_recorded_action_factory_registry_test
.....***Exception: Other  0.29 sec
        Start 107: krita-image-kis_recorded_action_test
107/173 Test #107: krita-image-kis_recorded_action_test
......................***Exception: Other  0.23 sec
        Start 108: krita-image-kis_recorded_filter_action_test
108/173 Test #108: krita-image-kis_recorded_filter_action_test
...............***Exception: Other  0.25 sec
        Start 109: krita-image-kis_selection_mask_test
109/173 Test #109: krita-image-kis_selection_mask_test
.......................***Exception: Other  0.23 sec
        Start 110: krita-image-kis_shared_ptr_test
110/173 Test #110: krita-image-kis_shared_ptr_test
...........................***Exception: Other  0.29 sec
        Start 111: krita-image-kis_bsplines_test
111/173 Test #111: krita-image-kis_bsplines_test
.............................***Exception: Other  0.24 sec
        Start 112: krita-image-kis_warp_transform_worker_test
112/173 Test #112: krita-image-kis_warp_transform_worker_test
................***Exception: Other  0.27 sec
        Start 113: krita-image-kis_liquify_transform_worker_test
113/173 Test #113: krita-image-kis_liquify_transform_worker_test
.............***Exception: Other  0.24 sec
        Start 114: krita-image-kis_transparency_mask_test
114/173 Test #114: krita-image-kis_transparency_mask_test
....................***Exception: Other  0.25 sec
        Start 115: krita-image-kis_types_test
115/173 Test #115: krita-image-kis_types_test
................................***Exception: Other  0.23 sec
        Start 116: krita-image-kis_vec_test
116/173 Test #116: krita-image-kis_vec_test
..................................***Exception: Other  0.25 sec
        Start 117: krita-image-kis_filter_config_widget_test
117/173 Test #117: krita-image-kis_filter_config_widget_test
.................***Exception: Other  0.23 sec
        Start 118: krita-image-kis_mask_generator_test
118/173 Test #118: krita-image-kis_mask_generator_test
.......................***Exception: Other  0.25 sec
        Start 119: krita-image-kis_cubic_curve_test
119/173 Test #119: krita-image-kis_cubic_curve_test
..........................***Exception: Other  0.24 sec
        Start 120: krita-image-kis_node_query_path_test
120/173 Test #120: krita-image-kis_node_query_path_test
......................***Exception: Other  0.24 sec
        Start 121: krita-image-kis_fixed_point_maths_test
121/173 Test #121: krita-image-kis_fixed_point_maths_test
....................***Exception: Other  0.23 sec
        Start 122: krita-image-kis_filter_weights_buffer_test
122/173 Test #122: krita-image-kis_filter_weights_buffer_test
................***Exception: Other  0.25 sec
        Start 123: krita-image-kis_filter_weights_applicator_test
123/173 Test #123: krita-image-kis_filter_weights_applicator_test
............***Exception: Other  0.22 sec
        Start 124: krita-image-kis_fill_interval_test
124/173 Test #124: krita-image-kis_fill_interval_test
........................***Exception: Other  0.24 sec
        Start 125: krita-image-kis_fill_interval_map_test
125/173 Test #125: krita-image-kis_fill_interval_map_test
....................***Exception: Other  0.24 sec
        Start 126: krita-image-kis_scanline_fill_test
126/173 Test #126: krita-image-kis_scanline_fill_test
........................***Exception: Other  0.25 sec
        Start 127: krita-image-kis_psd_layer_style_test
127/173 Test #127: krita-image-kis_psd_layer_style_test
......................***Exception: Other  0.22 sec
        Start 128: krita-image-kis_layer_style_projection_plane_test
128/173 Test #128: krita-image-kis_layer_style_projection_plane_test
.........***Exception: Other  0.25 sec
        Start 129: krita-image-kis_lod_capable_layer_offset_test
129/173 Test #129: krita-image-kis_lod_capable_layer_offset_test
.............***Exception: Other  0.24 sec
        Start 130: krita-image-kis_algebra_2d_test
130/173 Test #130: krita-image-kis_algebra_2d_test
...........................***Exception: Other  0.23 sec
        Start 131: krita-image-kis_marker_painter_test
131/173 Test #131: krita-image-kis_marker_painter_test
.......................***Exception: Other  0.24 sec
        Start 132: krita-image-kis_lazy_brush_test
132/173 Test #132: krita-image-kis_lazy_brush_test
...........................***Exception: Other  0.23 sec
        Start 133: krita-image-kis_colorize_mask_test
133/173 Test #133: krita-image-kis_colorize_mask_test
........................***Exception: Other  0.22 sec
        Start 134: kritaimage-layer_style_filter_environment_test
134/173 Test #134: kritaimage-layer_style_filter_environment_test
............***Exception: Other  0.25 sec
        Start 135: kritalibpsd-asl_parser_test
135/173 Test #135: kritalibpsd-asl_parser_test
...............................***Exception: Other  0.17 sec
        Start 136: krita-image-tiles3-kis_tiled_data_manager_test
136/173 Test #136: krita-image-tiles3-kis_tiled_data_manager_test
............***Exception: Other  0.28 sec
        Start 137: krita-image-tiles3-kis_low_memory_tests
137/173 Test #137: krita-image-tiles3-kis_low_memory_tests
...................***Exception: Other  0.23 sec
        Start 138: krita-image-tiles3-kis_lockless_stack_test
138/173 Test #138: krita-image-tiles3-kis_lockless_stack_test
................***Exception: Other  0.23 sec
        Start 139: krita-image-KisMemoryPoolTest
139/173 Test #139: krita-image-KisMemoryPoolTest
.............................***Exception: Other  0.14 sec
        Start 140: krita-image-KisChunkAllocatorTest
140/173 Test #140: krita-image-KisChunkAllocatorTest
.........................***Exception: Other  0.16 sec
        Start 141: krita-image-KisMemoryWindowTest
141/173 Test #141: krita-image-KisMemoryWindowTest
...........................***Exception: Other  0.19 sec
        Start 142: krita-ui-kis_image_view_converter_test
142/173 Test #142: krita-ui-kis_image_view_converter_test
....................***Exception: Other  0.50 sec
        Start 143: krita-ui-squeezedcombobox_test
143/173 Test #143: krita-ui-squeezedcombobox_test
............................***Exception: Other  0.34 sec
        Start 144: krita-ui-kis_kra_savexml_visitor_test
144/173 Test #144: krita-ui-kis_kra_savexml_visitor_test
.....................***Exception: Other  0.36 sec
        Start 145: krita-ui-kis_shape_selection_test
145/173 Test #145: krita-ui-kis_shape_selection_test
.........................***Exception: Other  0.40 sec
        Start 146: krita-ui-kis_recorded_action_editor_test
146/173 Test #146: krita-ui-kis_recorded_action_editor_test
..................***Exception: Other  0.35 sec
        Start 147: krita-ui-kis_doc2_test
147/173 Test #147: krita-ui-kis_doc2_test
....................................***Exception: Other  0.35 sec
        Start 148: krita-ui-kis_coordinates_converter_test
148/173 Test #148: krita-ui-kis_coordinates_converter_test
...................***Exception: Other  0.35 sec
        Start 149: krita-ui-kis_grid_config_test
149/173 Test #149: krita-ui-kis_grid_config_test
.............................***Exception: Other  0.40 sec
        Start 150: krita-ui-kis_stabilized_events_sampler_test
150/173 Test #150: krita-ui-kis_stabilized_events_sampler_test
...............***Exception: Other  0.40 sec
        Start 151: krita-ui-kis_derived_resources_test
151/173 Test #151: krita-ui-kis_derived_resources_test
.......................***Exception: Other  0.40 sec
        Start 152: krita-ui-kis_brush_hud_properties_config_test
152/173 Test #152: krita-ui-kis_brush_hud_properties_config_test
.............***Exception: Other  0.35 sec
        Start 153: krita-ui-kis_file_layer_test
153/173 Test #153: krita-ui-kis_file_layer_test
..............................***Exception: Other  0.38 sec
        Start 154: krita-ui-kis_multinode_property_test
154/173 Test #154: krita-ui-kis_multinode_property_test
......................***Exception: Other  0.34 sec
        Start 155: krita-ui-KisSelectionDecorationTest
155/173 Test #155: krita-ui-KisSelectionDecorationTest
.......................***Exception: Other  0.35 sec
        Start 156: krita-ui-KisNodeDummiesGraphTest
156/173 Test #156: krita-ui-KisNodeDummiesGraphTest
..........................***Exception: Other  0.37 sec
        Start 157: krita-ui-KisNodeShapesGraphTest
157/173 Test #157: krita-ui-KisNodeShapesGraphTest
...........................***Exception: Other  0.35 sec
        Start 158: krita-ui-KisModelIndexConverterTest
158/173 Test #158: krita-ui-KisModelIndexConverterTest
.......................***Exception: Other  0.46 sec
        Start 159: krita-ui-KisCategorizedListModelTest
159/173 Test #159: krita-ui-KisCategorizedListModelTest
......................***Exception: Other  0.34 sec
        Start 160: krita-ui-KisResourceServerProviderTest
160/173 Test #160: krita-ui-KisResourceServerProviderTest
....................***Exception: Other  0.37 sec
        Start 161: krita-image-BaseNodeTest
161/173 Test #161: krita-image-BaseNodeTest
..................................***Exception: Other  0.37 sec
        Start 162: krita-ui-KisKraSaverTest
162/173 Test #162: krita-ui-KisKraSaverTest
..................................***Exception: Other  0.36 sec
        Start 163: krita-image-kis_node_view_test
163/173 Test #163: krita-image-kis_node_view_test
............................***Exception: Other  0.35 sec
        Start 164: libs-pigment-TestKoLcmsColorProfile
164/173 Test #164: libs-pigment-TestKoLcmsColorProfile
.......................***Exception: Other  0.23 sec
        Start 165: krita-filters-kis_all_filter_test
165/173 Test #165: krita-filters-kis_all_filter_test
.........................***Exception: Other  0.27 sec
        Start 166: krita-filters-kis_crash_filter_test
166/173 Test #166: krita-filters-kis_crash_filter_test
.......................***Exception: Other  0.28 sec
        Start 167: krita-filters-unsharp-kis_unsharp_mask_test
167/173 Test #167: krita-filters-unsharp-kis_unsharp_mask_test
...............***Exception: Other  0.33 sec
        Start 168: krita-psd-psd_utils_test
168/173 Test #168: krita-psd-psd_utils_test
..................................***Exception: Other  0.20 sec
        Start 169: krita-psd-compression_test
169/173 Test #169: krita-psd-compression_test
................................***Exception: Other  0.12 sec
        Start 170: krita-psd-psd_header_test
170/173 Test #170: krita-psd-psd_header_test
.................................***Exception: Other  0.15 sec
        Start 171: krita-psd-psd_colormode_block_test
171/173 Test #171: krita-psd-psd_colormode_block_test
........................***Exception: Other  0.15 sec
        Start 172: krita-paintop-SensorsTest
172/173 Test #172: krita-paintop-SensorsTest
.................................***Exception: Other  1.44 sec
        Start 173: krita-basictools-MoveSelectionStrokeTest
173/173 Test #173: krita-basictools-MoveSelectionStrokeTest
..................***Exception: Other  0.58 sec

14% tests passed, 148 tests failed out of 173

Total Test time (real) =  43.18 sec

The following tests FAILED:
          4 - libs-widgets-zoomcontroller_test (OTHER_FAULT)
          5 - krita-ui-kis_parse_spin_boxes_test (OTHER_FAULT)
          8 - libs-odf-TestKoGenStyles (OTHER_FAULT)
         15 - libs-odf-kodomtest (OTHER_FAULT)
         17 - libs-odf-TestNumberStyle (OTHER_FAULT)
         18 - libs-odf-TestKoElementReference (OTHER_FAULT)
         21 - libs-kritaflake-TestPathTool (OTHER_FAULT)
         22 - libs-kritaflake-TestShapeAt (OTHER_FAULT)
         23 - libs-kritaflake-TestShapePainting (OTHER_FAULT)
         25 - libs-kritaflake-TestKoShapeRegistry (OTHER_FAULT)
         26 - libs-kritaflake-TestShapeContainer (OTHER_FAULT)
         27 - libs-kritaflake-TestShapeGroupCommand (OTHER_FAULT)
         28 - libs-kritaflake-TestShapeReorderCommand (OTHER_FAULT)
         29 - libs-kritaflake-TestImageCollection (OTHER_FAULT)
         30 - libs-kritaflake-TestResourceManager (OTHER_FAULT)
         31 - libs-kritaflake-TestShapeBackgroundCommand (OTHER_FAULT)
         32 - libs-kritaflake-TestShapeStrokeCommand (OTHER_FAULT)
         33 - libs-kritaflake-TestShapeShadowCommand (OTHER_FAULT)
         34 - libs-kritaflake-TestInputDevice (OTHER_FAULT)
         35 - libs-kritaflake-TestSnapStrategy (OTHER_FAULT)
         39 - libs-pigment-TestKoColor (Failed)
         43 - libs-pigment-TestKoColorSpaceSanity (Failed)
         48 - krita-libbrush-kis_auto_brush_test (OTHER_FAULT)
         49 - krita-libbrush-kis_gbr_brush_test (OTHER_FAULT)
         50 - krita-libbrush-kis_boundary_test (OTHER_FAULT)
         51 - krita-libbrush-kis_imagepipe_brush_test (OTHER_FAULT)
         52 - krita-image-kis_base_node_test (OTHER_FAULT)
         53 - krita-image-kis_fast_math_test (OTHER_FAULT)
         54 - krita-image-kis_node_test (OTHER_FAULT)
         55 - krita-image-kis_node_facade_test (OTHER_FAULT)
         56 - krita-image-kis_fixed_paint_device_test (OTHER_FAULT)
         57 - krita-image-kis_layer_test (OTHER_FAULT)
         58 - krita-image-kis_effect_mask_test (OTHER_FAULT)
         59 - krita-image-kis_iterator_test (OTHER_FAULT)
         60 - krita-image-kis_painter_test (OTHER_FAULT)
         61 - krita-image-kis_selection_test (OTHER_FAULT)
         62 - krita-image-kis_count_visitor_test (OTHER_FAULT)
         63 - krita-image-kis_projection_test (OTHER_FAULT)
         64 - krita-image-kis_properties_configuration_test (OTHER_FAULT)
         65 - krita-image-kis_transaction_test (OTHER_FAULT)
         66 - krita-image-kis_pixel_selection_test (OTHER_FAULT)
         67 - krita-image-kis_group_layer_test (OTHER_FAULT)
         68 - krita-image-kis_paint_layer_test (OTHER_FAULT)
         69 - krita-image-kis_adjustment_layer_test (OTHER_FAULT)
         70 - krita-image-kis_annotation_test (OTHER_FAULT)
         71 - krita-image-kis_change_profile_visitor_test (OTHER_FAULT)
         72 - krita-image-kis_clone_layer_test (OTHER_FAULT)
         73 - krita-image-kis_colorspace_convert_visitor_test (OTHER_FAULT)
         74 - krita-image-kis_convolution_painter_test (OTHER_FAULT)
         75 - krita-image-kis_crop_processing_visitor_test (OTHER_FAULT)
         76 - krita-image-kis_processing_applicator_test (OTHER_FAULT)
         77 - krita-image-kis_datamanager_test (OTHER_FAULT)
         78 - krita-image-kis_fill_painter_test (OTHER_FAULT)
         79 - krita-image-kis_filter_configuration_test (OTHER_FAULT)
         80 - krita-image-kis_filter_test (OTHER_FAULT)
         81 - krita-image-kis_filter_processing_information_test (OTHER_FAULT)
         82 - krita-image-kis_filter_registry_test (OTHER_FAULT)
         83 - krita-image-kis_filter_strategy_test (OTHER_FAULT)
         84 - krita-image-kis_gradient_painter_test (OTHER_FAULT)
         85 - krita-image-kis_image_commands_test (OTHER_FAULT)
         86 - krita-image-kis_image_test (OTHER_FAULT)
         87 - krita-image-kis_image_signal_router_test (OTHER_FAULT)
         88 - krita-image-kis_iterators_ng_test (OTHER_FAULT)
         89 - krita-image-kis_iterator_benchmark (OTHER_FAULT)
         90 - krita-image-kis_updater_context_test (OTHER_FAULT)
         91 - krita-image-kis_simple_update_queue_test (OTHER_FAULT)
         92 - krita-image-kis_stroke_test (OTHER_FAULT)
         93 - krita-image-kis_simple_stroke_strategy_test (OTHER_FAULT)
         94 - krita-image-kis_stroke_strategy_undo_command_based_test
(OTHER_FAULT)
         95 - krita-image-kis_strokes_queue_test (OTHER_FAULT)
         96 - krita-image-kis_macro_test (OTHER_FAULT)
         97 - krita-image-kis_mask_test (OTHER_FAULT)
         98 - krita-image-kis_math_toolbox_test (OTHER_FAULT)
         99 - krita-image-kis_name_server_test (OTHER_FAULT)
        100 - krita-image-kis_node_commands_test (OTHER_FAULT)
        101 - krita-image-kis_node_graph_listener_test (OTHER_FAULT)
        102 - krita-image-kis_node_visitor_test (OTHER_FAULT)
        103 - krita-image-kis_paint_information_test (OTHER_FAULT)
        104 - krita-image-kis_paintop_test (OTHER_FAULT)
        105 - krita-image-kis_pattern_test (OTHER_FAULT)
        106 - krita-image-kis_recorded_action_factory_registry_test
(OTHER_FAULT)
        107 - krita-image-kis_recorded_action_test (OTHER_FAULT)
        108 - krita-image-kis_recorded_filter_action_test (OTHER_FAULT)
        109 - krita-image-kis_selection_mask_test (OTHER_FAULT)
        110 - krita-image-kis_shared_ptr_test (OTHER_FAULT)
        111 - krita-image-kis_bsplines_test (OTHER_FAULT)
        112 - krita-image-kis_warp_transform_worker_test (OTHER_FAULT)
        113 - krita-image-kis_liquify_transform_worker_test (OTHER_FAULT)
        114 - krita-image-kis_transparency_mask_test (OTHER_FAULT)
        115 - krita-image-kis_types_test (OTHER_FAULT)
        116 - krita-image-kis_vec_test (OTHER_FAULT)
        117 - krita-image-kis_filter_config_widget_test (OTHER_FAULT)
        118 - krita-image-kis_mask_generator_test (OTHER_FAULT)
        119 - krita-image-kis_cubic_curve_test (OTHER_FAULT)
        120 - krita-image-kis_node_query_path_test (OTHER_FAULT)
        121 - krita-image-kis_fixed_point_maths_test (OTHER_FAULT)
        122 - krita-image-kis_filter_weights_buffer_test (OTHER_FAULT)
        123 - krita-image-kis_filter_weights_applicator_test (OTHER_FAULT)
        124 - krita-image-kis_fill_interval_test (OTHER_FAULT)
        125 - krita-image-kis_fill_interval_map_test (OTHER_FAULT)
        126 - krita-image-kis_scanline_fill_test (OTHER_FAULT)
        127 - krita-image-kis_psd_layer_style_test (OTHER_FAULT)
        128 - krita-image-kis_layer_style_projection_plane_test (OTHER_FAULT)
        129 - krita-image-kis_lod_capable_layer_offset_test (OTHER_FAULT)
        130 - krita-image-kis_algebra_2d_test (OTHER_FAULT)
        131 - krita-image-kis_marker_painter_test (OTHER_FAULT)
        132 - krita-image-kis_lazy_brush_test (OTHER_FAULT)
        133 - krita-image-kis_colorize_mask_test (OTHER_FAULT)
        134 - kritaimage-layer_style_filter_environment_test (OTHER_FAULT)
        135 - kritalibpsd-asl_parser_test (OTHER_FAULT)
        136 - krita-image-tiles3-kis_tiled_data_manager_test (OTHER_FAULT)
        137 - krita-image-tiles3-kis_low_memory_tests (OTHER_FAULT)
        138 - krita-image-tiles3-kis_lockless_stack_test (OTHER_FAULT)
        139 - krita-image-KisMemoryPoolTest (OTHER_FAULT)
        140 - krita-image-KisChunkAllocatorTest (OTHER_FAULT)
        141 - krita-image-KisMemoryWindowTest (OTHER_FAULT)
        142 - krita-ui-kis_image_view_converter_test (OTHER_FAULT)
        143 - krita-ui-squeezedcombobox_test (OTHER_FAULT)
        144 - krita-ui-kis_kra_savexml_visitor_test (OTHER_FAULT)
        145 - krita-ui-kis_shape_selection_test (OTHER_FAULT)
        146 - krita-ui-kis_recorded_action_editor_test (OTHER_FAULT)
        147 - krita-ui-kis_doc2_test (OTHER_FAULT)
        148 - krita-ui-kis_coordinates_converter_test (OTHER_FAULT)
        149 - krita-ui-kis_grid_config_test (OTHER_FAULT)
        150 - krita-ui-kis_stabilized_events_sampler_test (OTHER_FAULT)
        151 - krita-ui-kis_derived_resources_test (OTHER_FAULT)
        152 - krita-ui-kis_brush_hud_properties_config_test (OTHER_FAULT)
        153 - krita-ui-kis_file_layer_test (OTHER_FAULT)
        154 - krita-ui-kis_multinode_property_test (OTHER_FAULT)
        155 - krita-ui-KisSelectionDecorationTest (OTHER_FAULT)
        156 - krita-ui-KisNodeDummiesGraphTest (OTHER_FAULT)
        157 - krita-ui-KisNodeShapesGraphTest (OTHER_FAULT)
        158 - krita-ui-KisModelIndexConverterTest (OTHER_FAULT)
        159 - krita-ui-KisCategorizedListModelTest (OTHER_FAULT)
        160 - krita-ui-KisResourceServerProviderTest (OTHER_FAULT)
        161 - krita-image-BaseNodeTest (OTHER_FAULT)
        162 - krita-ui-KisKraSaverTest (OTHER_FAULT)
        163 - krita-image-kis_node_view_test (OTHER_FAULT)
        164 - libs-pigment-TestKoLcmsColorProfile (OTHER_FAULT)
        165 - krita-filters-kis_all_filter_test (OTHER_FAULT)
        166 - krita-filters-kis_crash_filter_test (OTHER_FAULT)
        167 - krita-filters-unsharp-kis_unsharp_mask_test (OTHER_FAULT)
        168 - krita-psd-psd_utils_test (OTHER_FAULT)
        169 - krita-psd-compression_test (OTHER_FAULT)
        170 - krita-psd-psd_header_test (OTHER_FAULT)
        171 - krita-psd-psd_colormode_block_test (OTHER_FAULT)
        172 - krita-paintop-SensorsTest (OTHER_FAULT)
        173 - krita-basictools-MoveSelectionStrokeTest (OTHER_FAULT)
Errors while running CTest
FAILED: CMakeFiles/test.util
cd /usr/ports/pobj/krita-3.1.3/build-amd64 && /usr/local/bin/ctest
--force-new-ctest-process
ninja: build stopped: subcommand failed.
*** Error 1 in . (/usr/ports/devel/cmake/cmake.port.mk:41 'do-test')
*** Error 1 in . (/usr/ports/infrastructure/mk/bsd.port.mk:2690
'/usr/ports/pobj/krita-3.1.3/build-amd64/.test_done')
*** Error 1 in /usr/ports/myshit/krita
(/usr/ports/infrastructure/mk/bsd.port.mk:2363 'test')

I don't know if it matters or not if they don't all pass? Someone can
correct me if im wrong.


On Sat, May 13, 2017 at 3:56 AM, Rafael Sadowski <[hidden email]> wrote:

> Hi All!
>
> Attached is a port of krita. It is a part of our old editors/calligra
> therefore is a @conflict callingra-<=2.9.11 tag in PLIST. Krita "split"
> from calligra since 3.0.[1] Tested in amd64.
>
> $ cat pkg/DESCR
>
> Krita is a raster graphics editor based on Qt 5 and the KDE Frameworks 5. Krita
> is designed to be a digital painting application. It has been influenced to
> some extent by software like Corel Painter and SAI. Krita packs with some key
> features different from most of its kind, including the ability to work with
> both bitmap and vector illustration.
>
> Core features:
>
> - An adaptive multi-modal interface which works on the desktop and touchscreens
> - A large set of default brushes
> - Customizable brush presets
> - Multiple brush engines, supports pressure sensitivity, tilt and other
>   features of graphics tablets
> - Wrap around mode canvas for creating and visualizing seamlessly tiled
>   textures
> - OpenGL powered canvas with high-bit-depth monitor support
> - Filters with real-time preview
> - A layer engine that allows deeply nested and grouped layers
> - Vector, clone, external-file and dynamic filter-effect layers
> - Supports a wide range of file formats and color models
>
>
> Comments? OK to import?
>
> Best regards,
>
> Rafael Sadowski
>
>
> [1]: https://www.calligra.org/krita/

Reply | Threaded
Open this post in threaded view
|

Re: NEW: graphics/krita

Stuart Henderson
In reply to this post by Rafael Sadowski
On 2017/05/13 10:56, Rafael Sadowski wrote:
> Attached is a port of krita. It is a part of our old editors/calligra
> therefore is a @conflict callingra-<=2.9.11 tag in PLIST.

calligra, not callingra

Reply | Threaded
Open this post in threaded view
|

Re: NEW: graphics/krita

Rafael Sadowski
In reply to this post by mitchell wodach
On Sun May 14, 2017 at 08:38:13PM -0500, mitchell wodach wrote:

> A whole bunch of tests fail.
>
> Errors while running CTest
> FAILED: CMakeFiles/test.util
> cd /usr/ports/pobj/krita-3.1.3/build-amd64 && /usr/local/bin/ctest
> --force-new-ctest-process
> ninja: build stopped: subcommand failed.
> *** Error 1 in . (/usr/ports/devel/cmake/cmake.port.mk:41 'do-test')
> *** Error 1 in . (/usr/ports/infrastructure/mk/bsd.port.mk:2690
> '/usr/ports/pobj/krita-3.1.3/build-amd64/.test_done')
> *** Error 1 in /usr/ports/myshit/krita
> (/usr/ports/infrastructure/mk/bsd.port.mk:2363 'test')
>
> I don't know if it matters or not if they don't all pass? Someone can
> correct me if im wrong.
>
Hi Mitchell Wodach,

thanks for running test. Krita needs `TEST_IS_INTERACTIVE = X11` to
provide test results like:

80% tests passed, 34 tests failed out of 173

Please find attached a new version with TEST_IS_INTERACTIVE in Makefile
and typo-fix in PLIST from sthen@.

Best regards,

Rafael Sadowski

krita_2017_05_16.tar.gz (13K) Download Attachment
Reply | Threaded
Open this post in threaded view
|

Re: NEW: graphics/krita

Jeremie Courreges-Anglas-2
Rafael Sadowski <[hidden email]> writes:

> On Sun May 14, 2017 at 08:38:13PM -0500, mitchell wodach wrote:
>> A whole bunch of tests fail.
>>
>> Errors while running CTest
>> FAILED: CMakeFiles/test.util
>> cd /usr/ports/pobj/krita-3.1.3/build-amd64 && /usr/local/bin/ctest
>> --force-new-ctest-process
>> ninja: build stopped: subcommand failed.
>> *** Error 1 in . (/usr/ports/devel/cmake/cmake.port.mk:41 'do-test')
>> *** Error 1 in . (/usr/ports/infrastructure/mk/bsd.port.mk:2690
>> '/usr/ports/pobj/krita-3.1.3/build-amd64/.test_done')
>> *** Error 1 in /usr/ports/myshit/krita
>> (/usr/ports/infrastructure/mk/bsd.port.mk:2363 'test')
>>
>> I don't know if it matters or not if they don't all pass? Someone can
>> correct me if im wrong.
>>
>
> Hi Mitchell Wodach,
>
> thanks for running test. Krita needs `TEST_IS_INTERACTIVE = X11` to
> provide test results like:
>
> 80% tests passed, 34 tests failed out of 173
>
> Please find attached a new version with TEST_IS_INTERACTIVE in Makefile
> and typo-fix in PLIST from sthen@.

make package warns:

===>  Building package for krita-3.1.3
Create /usr/ports/packages/amd64/all/krita-3.1.3.tgz
LIB_DEPENDS devel/kf5/kitemmodels not needed for graphics/krita ?
Link to /usr/ports/packages/amd64/ftp/krita-3.1.3.tgz
Link to /usr/ports/packages/amd64/cdrom/krita-3.1.3.tgz

Except for this, the rest seems good ports-wise, though I'm far from
being a kf5/kde expert...  Also krita seems to work fine here in a dumb
wm (x11/ratpoison).

--
jca | PGP : 0x1524E7EE / 5135 92C1 AD36 5293 2BDF  DDCC 0DFA 74AE 1524 E7EE

Reply | Threaded
Open this post in threaded view
|

Re: NEW: graphics/krita

Jeremie Courreges-Anglas-2
Jeremie Courreges-Anglas <[hidden email]> writes:

> Rafael Sadowski <[hidden email]> writes:
>
>> On Sun May 14, 2017 at 08:38:13PM -0500, mitchell wodach wrote:
>>> A whole bunch of tests fail.
>>>
>>> Errors while running CTest
>>> FAILED: CMakeFiles/test.util
>>> cd /usr/ports/pobj/krita-3.1.3/build-amd64 && /usr/local/bin/ctest
>>> --force-new-ctest-process
>>> ninja: build stopped: subcommand failed.
>>> *** Error 1 in . (/usr/ports/devel/cmake/cmake.port.mk:41 'do-test')
>>> *** Error 1 in . (/usr/ports/infrastructure/mk/bsd.port.mk:2690
>>> '/usr/ports/pobj/krita-3.1.3/build-amd64/.test_done')
>>> *** Error 1 in /usr/ports/myshit/krita
>>> (/usr/ports/infrastructure/mk/bsd.port.mk:2363 'test')
>>>
>>> I don't know if it matters or not if they don't all pass? Someone can
>>> correct me if im wrong.
>>>
>>
>> Hi Mitchell Wodach,
>>
>> thanks for running test. Krita needs `TEST_IS_INTERACTIVE = X11` to
>> provide test results like:
>>
>> 80% tests passed, 34 tests failed out of 173
>>
>> Please find attached a new version with TEST_IS_INTERACTIVE in Makefile
>> and typo-fix in PLIST from sthen@.
>
> make package warns:
>
> ===>  Building package for krita-3.1.3
> Create /usr/ports/packages/amd64/all/krita-3.1.3.tgz
> LIB_DEPENDS devel/kf5/kitemmodels not needed for graphics/krita ?
> Link to /usr/ports/packages/amd64/ftp/krita-3.1.3.tgz
> Link to /usr/ports/packages/amd64/cdrom/krita-3.1.3.tgz
>
> Except for this, the rest seems good ports-wise, though I'm far from
> being a kf5/kde expert...  Also krita seems to work fine here in a dumb
> wm (x11/ratpoison).

Could you please add comments in the patches?  It's not obvious what
they are supposed to achieve.
patch-plugins_extensions_gmic_3rdparty_gmic_CImg_h already has a comment
in the calligra port.

It seems that some shared libs now provided by krita were part of
calligra before.  They should not start at 0.0, but retain their old
version number (bumped, if necessary).

--
jca | PGP : 0x1524E7EE / 5135 92C1 AD36 5293 2BDF  DDCC 0DFA 74AE 1524 E7EE

Reply | Threaded
Open this post in threaded view
|

Re: NEW: graphics/krita

mitchell wodach
I  still get a 14% test failure. But the port still finishes the rest
of the steps and runs fine on amd64.

Reply | Threaded
Open this post in threaded view
|

Re: NEW: graphics/krita

Rafael Sadowski
In reply to this post by Jeremie Courreges-Anglas-2
On Tue May 16, 2017 at 01:49:01PM +0200, Jeremie Courreges-Anglas wrote:

> Jeremie Courreges-Anglas <[hidden email]> writes:
>
> > Rafael Sadowski <[hidden email]> writes:
> >
> >> On Sun May 14, 2017 at 08:38:13PM -0500, mitchell wodach wrote:
> >>> A whole bunch of tests fail.
> >>>
> >>> Errors while running CTest
> >>> FAILED: CMakeFiles/test.util
> >>> cd /usr/ports/pobj/krita-3.1.3/build-amd64 && /usr/local/bin/ctest
> >>> --force-new-ctest-process
> >>> ninja: build stopped: subcommand failed.
> >>> *** Error 1 in . (/usr/ports/devel/cmake/cmake.port.mk:41 'do-test')
> >>> *** Error 1 in . (/usr/ports/infrastructure/mk/bsd.port.mk:2690
> >>> '/usr/ports/pobj/krita-3.1.3/build-amd64/.test_done')
> >>> *** Error 1 in /usr/ports/myshit/krita
> >>> (/usr/ports/infrastructure/mk/bsd.port.mk:2363 'test')
> >>>
> >>> I don't know if it matters or not if they don't all pass? Someone can
> >>> correct me if im wrong.
> >>>
> >>
> >> Hi Mitchell Wodach,
> >>
> >> thanks for running test. Krita needs `TEST_IS_INTERACTIVE = X11` to
> >> provide test results like:
> >>
> >> 80% tests passed, 34 tests failed out of 173
> >>
> >> Please find attached a new version with TEST_IS_INTERACTIVE in Makefile
> >> and typo-fix in PLIST from sthen@.
> >
> > make package warns:
> >
> > ===>  Building package for krita-3.1.3
> > Create /usr/ports/packages/amd64/all/krita-3.1.3.tgz
> > LIB_DEPENDS devel/kf5/kitemmodels not needed for graphics/krita ?
> > Link to /usr/ports/packages/amd64/ftp/krita-3.1.3.tgz
> > Link to /usr/ports/packages/amd64/cdrom/krita-3.1.3.tgz
> >
> > Except for this, the rest seems good ports-wise, though I'm far from
> > being a kf5/kde expert...  Also krita seems to work fine here in a dumb
> > wm (x11/ratpoison).
>
> Could you please add comments in the patches?  It's not obvious what
> they are supposed to achieve.
> patch-plugins_extensions_gmic_3rdparty_gmic_CImg_h already has a comment
> in the calligra port.
>
> It seems that some shared libs now provided by krita were part of
> calligra before.  They should not start at 0.0, but retain their old
> version number (bumped, if necessary).
>
Please find attached an updated tarball with all your hints here and on
ICB. Additional:

- update to the last stable version 3.1.4
- fix portcheck noise
- move kitemmodels from LIB_DEPENDS to BUILD_DEPENDS

Ok?

Best regards,

Rafael Sadowski

krita_2017_05_30.tar.gz (13K) Download Attachment